Reaction Details
TargetAcidic phospholipase A2 CM-I
LigandBDBM50165900
Substrate/Competitorn/a
Meas. Tech.ChEMBL_302348 (CHEMBL828931)
Ki 73000±n/a nM
Citation Lin, GYu, GY QSAR for phospholipase A2 inhibitions by 1-acyloxy-3-N-n-octylcarbamyl-benzenes. Bioorg Med Chem Lett15:2405-8 (2005) 
 
Acidic phospholipase A2 CM-I
Name:Acidic phospholipase A2 CM-I
Type:PROTEIN
Mol. Mass.:13219.33
Organism:Naja mossambica
Description:ChEMBL_302348
Residue:118
BDBM50165900
NameBDBM50165900
Synonyms:CHEMBL195187 | Phenyl-acetic acid 3-octylcarbamoyloxy-phenyl ester
TypeSmall organic molecule
Emp. Form.C23H29NO4
Mol. Mass.383.4807
SMILESCCCCCCCCNC(=O)Oc1cccc(OC(=O)Cc2ccccc2)c1