Reaction Details
TargetMelanocyte-stimulating hormone receptor
LigandBDBM50165932
Substrate/Competitorn/a
Meas. Tech.ChEMBL_303605 (CHEMBL829694)
Ki 0.210000±n/a nM
Citation Mayer, JPHsiung, HMFlora, DBEdwards, PSmith, DPZhang, XYGadski, RAHeiman, MLHertel, JLEmmerson, PJHusain, SO'brien, TPKahl, SDSmiley, DLZhang, LDimarchi, RDYan, LZ Discovery of a beta-MSH-derived MC-4R selective agonist. J Med Chem48:3095-8 (2005) 
 
Melanocyte-stimulating hormone receptor
Name:Melanocyte-stimulating hormone receptor
Type:Enzyme
Mol. Mass.:34717.23
Organism:Homo sapiens (Human)
Description:Q01726
Residue:317
BDBM50165932
NameBDBM50165932
Synonyms:Ac-YRMEHdFRWG-NH2 | CHEMBL266879
TypeSmall organic molecule
Emp. Form.C61H83N19O13S
Mol. Mass.1322.496
SMILESCSCC[C@H](NC(=O)[C@H](CCCNC(N)=N)NC(=O)[C@H](Cc1ccc(O)cc1)NC(C)=O)C(=O)N[C@@H](CCC(O)=O)C(=O)N[C@@H](Cc1cnc[nH]1)C(=O)N[C@H](Cc1ccccc1)C(=O)N[C@@H](CCCNC(N)=N)C(=O)N[C@@H](Cc1c[nH]c2ccccc12)C(=O)NCC(N)=O