Reaction Details
TargetProstaglandin F2-alpha receptor
LigandBDBM50165949
Substrate/Competitorn/a
Meas. Tech.ChEMBL_303033 (CHEMBL828861)
Ki>3000±n/a nM
Citation Hattori, KTanaka, AFujii, NTakasugi, HTenda, YTomita, MNakazato, SNakano, KKato, YKono, YMurai, HSakane, K Discovery of diphenyloxazole and Ndelta-Z-ornithine derivatives as highly potent and selective human prostaglandin EP(4) receptor antagonists. J Med Chem48:3103-6 (2005) 
 
Prostaglandin F2-alpha receptor
Name:Prostaglandin F2-alpha receptor
Type:Enzyme
Mol. Mass.:40072.29
Organism:Homo sapiens (Human)
Description:P43088
Residue:359
BDBM50165949
NameBDBM50165949
Synonyms:C-Phenyl-N-{3-[2-((S)-5-phenyl-4-phenyl-oxazol-2-yl)-cyclohex-2-enylmethyl]-benzoyl}-methanesulfonamide | CHEMBL191638
TypeSmall organic molecule
Emp. Form.C36H32N2O4S
Mol. Mass.588.715
SMILESO=C(NS(=O)(=O)Cc1ccccc1)c1cccc(C[C@@H]2CCCC=C2c2nc(c(o2)-c2ccccc2)-c2ccccc2)c1