Reaction Details
TargetProstaglandin F2-alpha receptor
LigandBDBM50165943
Substrate/Competitorn/a
Meas. Tech.ChEMBL_303033 (CHEMBL828861)
Ki>1000±n/a nM
Citation Hattori, KTanaka, AFujii, NTakasugi, HTenda, YTomita, MNakazato, SNakano, KKato, YKono, YMurai, HSakane, K Discovery of diphenyloxazole and Ndelta-Z-ornithine derivatives as highly potent and selective human prostaglandin EP(4) receptor antagonists. J Med Chem48:3103-6 (2005) 
 
Prostaglandin F2-alpha receptor
Name:Prostaglandin F2-alpha receptor
Type:Enzyme
Mol. Mass.:40072.29
Organism:Homo sapiens (Human)
Description:P43088
Residue:359
BDBM50165943
NameBDBM50165943
Synonyms:(S)-2-{(S)-5-Benzyloxycarbonylamino-2-[(1H-indole-2-carbonyl)-amino]-pentanoylamino}-3-phenyl-propionic acid | CHEMBL191898
TypeSmall organic molecule
Emp. Form.C31H32N4O6
Mol. Mass.556.609
SMILESOC(=O)[C@H](Cc1ccccc1)NC(=O)[C@H](CCCNC(=O)OCc1ccccc1)NC(=O)c1cc2ccccc2[nH]1