Reaction Details
TargetEphrin type-B receptor 2
LigandBDBM39299
Substrate/Competitorn/a
Meas. Tech.ChEMBL_304919 (CHEMBL827811)
IC50 5200±n/a nM
Citation Toledo-Sherman, LDeretey, ESlon-Usakiewicz, JJNg, WDai, JRFoster, JERedden, PRUger, MDLiao, LCPasternak, AReid, N Frontal affinity chromatography with MS detection of EphB2 tyrosine kinase receptor. 2. Identification of small-molecule inhibitors via coupling with virtual screening. J Med Chem48:3221-30 (2005) 
 
Ephrin type-B receptor 2
Name:Ephrin type-B receptor 2
Type:PROTEIN
Mol. Mass.:117491.44
Organism:Homo sapiens (Human)
Description:ChEMBL_1476221
Residue:1055
BDBM39299
NameBDBM39299
Synonyms:3-imidazol-1-ylpropyl(7H-purin-6-yl)amine MLS000101210 N-[3-(1-imidazolyl)propyl]-7H-purin-6-amine cid_4639586
TypeSmall organic molecule
Emp. Form.C11H13N7
Mol. Mass.243.2678
SMILESC(CNc1ncnc2nc[nH]c12)Cn1ccnc1