Reaction Details
TargetEphrin type-B receptor 2
LigandBDBM3032
Substrate/Competitorn/a
Meas. Tech.ChEMBL_302212 (CHEMBL826985)
Kd 8100±n/a nM
Citation Toledo-Sherman, LDeretey, ESlon-Usakiewicz, JJNg, WDai, JRFoster, JERedden, PRUger, MDLiao, LCPasternak, AReid, N Frontal affinity chromatography with MS detection of EphB2 tyrosine kinase receptor. 2. Identification of small-molecule inhibitors via coupling with virtual screening. J Med Chem48:3221-30 (2005) 
 
Ephrin type-B receptor 2
Name:Ephrin type-B receptor 2
Type:PROTEIN
Mol. Mass.:117491.44
Organism:Homo sapiens (Human)
Description:ChEMBL_1476221
Residue:1055
BDBM3032
NameBDBM3032
Synonyms:CHEMBL1204168 N-(3-bromophenyl)-6,7-dimethoxyquinazolin-4-amine US11001595, Compound PD153035 US9422297, PD153035
TypeSmall organic molecule
Emp. Form.C16H14BrN3O2
Mol. Mass.360.205
SMILESCOc1cc2ncnc(Nc3cccc(Br)c3)c2cc1OC