Reaction Details
TargetEphrin type-B receptor 2
LigandBDBM50166045
Substrate/Competitorn/a
Meas. Tech.ChEMBL_304919 (CHEMBL827811)
IC50 65000±n/a nM
Citation Toledo-Sherman, LDeretey, ESlon-Usakiewicz, JJNg, WDai, JRFoster, JERedden, PRUger, MDLiao, LCPasternak, AReid, N Frontal affinity chromatography with MS detection of EphB2 tyrosine kinase receptor. 2. Identification of small-molecule inhibitors via coupling with virtual screening. J Med Chem48:3221-30 (2005) 
 
Ephrin type-B receptor 2
Name:Ephrin type-B receptor 2
Type:PROTEIN
Mol. Mass.:117491.44
Organism:Homo sapiens (Human)
Description:ChEMBL_1476221
Residue:1055
BDBM50166045
NameBDBM50166045
Synonyms:3-(4-Chloro-phenyl)-1-[2-(5-fluoro-2-methyl-1H-indol-3-yl)-ethyl]-1-pyridin-4-ylmethyl-thiourea | CHEMBL191403
TypeSmall organic molecule
Emp. Form.C24H22ClFN4S
Mol. Mass.452.975
SMILESCc1[nH]c2ccc(F)cc2c1CCN(Cc1ccncc1)C(=S)Nc1ccc(Cl)cc1