Reaction Details
TargetMu-type opioid receptor
LigandBDBM50166054
Substrate/Competitorn/a
Meas. Tech.ChEMBL_303703 (CHEMBL829038)
Ki 0.35±n/a nM
Citation Martinek, TAOtvös, FDervarics, MTóth, GFülöp, F Ligand-based prediction of active conformation by 3D-QSAR flexibility descriptors and their application in 3+3D-QSAR models. J Med Chem48:3239-50 (2005) 
 
Mu-type opioid receptor
Name:Mu-type opioid receptor
Type:G Protein-Coupled Receptor (GPCR)
Mol. Mass.:44503.11
Organism:Rattus norvegicus (rat)
Description:Competition binding assays were carried out using membrane preparations from transfected HN9.10 cells that constitutively expressed the mu opioid receptor.
Residue:398
BDBM50166054
NameBDBM50166054
Synonyms:(S)-1-[(S)-2-Amino-3-(4-hydroxy-2,6-dimethyl-phenyl)-propionyl]-pyrrolidine-2-carboxylic acid [(S)-1-((1S,2S)-1-carbamoyl-2-phenyl-propylcarbamoyl)-2-phenyl-ethyl]-amide | CHEMBL192372
TypeSmall organic molecule
Emp. Form.C35H43N5O5
Mol. Mass.613.7464
SMILESC[C@H]([C@H](NC(=O)[C@H](Cc1ccccc1)NC(=O)[C@@H]1CCCN1C(=O)[C@@H](N)Cc1c(C)cc(O)cc1C)C(N)=O)c1ccccc1