Reaction Details
TargetMu-type opioid receptor
LigandBDBM50166055
Substrate/Competitorn/a
Meas. Tech.ChEMBL_303715 (CHEMBL829050)
Ki 1.2±n/a nM
Citation Martinek, TAOtvös, FDervarics, MTóth, GFülöp, F Ligand-based prediction of active conformation by 3D-QSAR flexibility descriptors and their application in 3+3D-QSAR models. J Med Chem48:3239-50 (2005) 
 
Mu-type opioid receptor
Name:Mu-type opioid receptor
Type:Enzyme Catalytic Domain
Mol. Mass.:44431.62
Organism:MOUSE
Description:OPIATE Mu OPRM1 MOUSE::P42866
Residue:398
BDBM50166055
NameBDBM50166055
Synonyms:(1S,2R)-2-[2-Amino-3-((S)-4-hydroxy-2,6-dimethyl-phenyl)-propionylamino]-cyclopentanecarboxylic acid [(S)-1-((S)-1-carbamoyl-2-phenyl-ethylcarbamoyl)-2-phenyl-ethyl]-amide | CHEMBL193946
TypeSmall organic molecule
Emp. Form.C35H43N5O5
Mol. Mass.613.7464
SMILESCc1cc(O)cc(C)c1C[C@H](N)C(=O)N[C@@H]1CCC[C@@H]1C(=O)N[C@@H](Cc1ccccc1)C(=O)N[C@@H](Cc1ccccc1)C(N)=O