Reaction Details
TargetC-X-C chemokine receptor type 4
LigandBDBM50166079
Substrate/Competitorn/a
Meas. Tech.ChEMBL_306317 (CHEMBL827762)
IC50 10±n/a nM
Citation Tamamura, HAraki, TUeda, SWang, ZOishi, SEsaka, ATrent, JONakashima, HYamamoto, NPeiper, SCOtaka, AFujii, N Identification of novel low molecular weight CXCR4 antagonists by structural tuning of cyclic tetrapeptide scaffolds. J Med Chem48:3280-9 (2005) 
 
C-X-C chemokine receptor type 4
Name:C-X-C chemokine receptor type 4
Type:Enzyme
Mol. Mass.:39754.61
Organism:Homo sapiens (Human)
Description:P61073
Residue:352
BDBM50166079
NameBDBM50166079
Synonyms:CHEMBL192183 | N-[(2R,5R,11S,14S,16aS)-14-(3-Guanidino-propyl)-5-(4-hydroxy-benzyl)-11-naphthalen-2-ylmethyl-4,7,10,13,16-pentaoxo-hexadecahydro-3a,6,9,12,15-pentaaza-cyclopentacyclopentadecen-2-yl]-guanidine
TypeSmall organic molecule
Emp. Form.C36H45N11O6
Mol. Mass.727.8126
SMILES[#7]-[#6](=[#7])-[#7]-[#6]-[#6]-[#6]-[#6@@H]-1-[#7]-[#6](=O)-[#6@@H]-2-[#6]-[#6@H](-[#6]-[#7]-2-[#6](=O)-[#6@@H](-[#6]-c2ccc(-[#8])cc2)-[#7]-[#6](=O)-[#6]-[#7]-[#6](=O)-[#6@H](-[#6]-c2ccc3ccccc3c2)-[#7]-[#6]-1=O)\[#7]=[#6](/[#7])-[#7]