Reaction Details
TargetC-X-C chemokine receptor type 4
LigandBDBM50166106
Substrate/Competitorn/a
Meas. Tech.ChEMBL_306317 (CHEMBL827762)
IC50 8.4±n/a nM
Citation Tamamura, HAraki, TUeda, SWang, ZOishi, SEsaka, ATrent, JONakashima, HYamamoto, NPeiper, SCOtaka, AFujii, N Identification of novel low molecular weight CXCR4 antagonists by structural tuning of cyclic tetrapeptide scaffolds. J Med Chem48:3280-9 (2005) 
 
C-X-C chemokine receptor type 4
Name:C-X-C chemokine receptor type 4
Type:Enzyme
Mol. Mass.:39754.61
Organism:Homo sapiens (Human)
Description:P61073
Residue:352
BDBM50166106
NameBDBM50166106
Synonyms:CHEMBL436283 cyclo(-D-Tyr-Arg-Arg-Nal-Gly-)
TypeSmall organic molecule
Emp. Form.C36H47N11O6
Mol. Mass.729.8285
SMILES[#7]\[#6](-[#7])=[#7]\[#6]-[#6]-[#6]-[#6@@H]-1-[#7]-[#6](=O)-[#6@H](-[#6]-[#6]-[#6]\[#7]=[#6](\[#7])-[#7])-[#7]-[#6](=O)-[#6@@H](-[#6]-c2ccc(-[#8])cc2)-[#7]-[#6](=O)-[#6]-[#7]-[#6](=O)-[#6@H](-[#6]-c2ccc3ccccc3c2)-[#7]-[#6]-1=O