Reaction Details
TargetLysophosphatidic acid receptor 3
LigandBDBM50166114
Substrate/Competitorn/a
Meas. Tech.ChEMBL_304392 (CHEMBL830042)
EC50>10000±n/a nM
Citation Xu, YAoki, JShimizu, KUmezu-Goto, MHama, KTakanezawa, YYu, SMills, GBArai, HQian, LPrestwich, GD Structure-activity relationships of fluorinated lysophosphatidic acid analogues. J Med Chem48:3319-27 (2005) 
 
Lysophosphatidic acid receptor 3
Name:Lysophosphatidic acid receptor 3
Type:Enzyme
Mol. Mass.:40149.72
Organism:Homo sapiens (Human)
Description:Q9UBY5
Residue:353
BDBM50166114
NameBDBM50166114
Synonyms:(E)-Octadec-9-enoic acid (S)-3,3-difluoro-1-phosphonooxymethyl-allyl ester | CHEMBL191737
TypeSmall organic molecule
Emp. Form.C22H41F2O6P
Mol. Mass.470.5279
SMILESCCCCCCCC\C=C\CCCCCCCC(=O)O[C@H](COP(O)(O)=O)CC(F)F