Reaction Details
TargetAdenosine kinase
LigandBDBM50090887
Substrate/Competitorn/a
Meas. Tech.ChEMBL_304730 (CHEMBL876476)
IC50 0.5±n/a nM
Citation Bookser, BCMatelich, MCOllis, KUgarkar, BG Adenosine kinase inhibitors. 4. 6,8-Disubstituted purine nucleoside derivatives. Synthesis, conformation, and enzyme inhibition. J Med Chem48:3389-99 (2005) 
 
Adenosine kinase
Name:Adenosine kinase
Type:PROTEIN
Mol. Mass.:40545.97
Organism:Homo sapiens (Human)
Description:ChEMBL_1467841
Residue:362
BDBM50090887
NameBDBM50090887
Synonyms:(1R,4S,5R)-2-Methyl-5-(5-phenyl-4-phenylamino-pyrrolo[2,3-d]pyrimidin-7-yl)-tetrahydro-furan-3,4-diol 2-Methyl-5-(5-phenyl-4-phenylamino-pyrrolo[2,3-d]pyrimidin-7-yl)-tetrahydro-furan-3,4-diol CHEMBL100421
TypeSmall organic molecule
Emp. Form.C23H22N4O3
Mol. Mass.402.4458
SMILESC[C@H]1O[C@H]([C@H](O)[C@@H]1O)n1cc(-c2ccccc2)c2c(Nc3ccccc3)ncnc12