Reaction Details
TargetProstaglandin G/H synthase 2
LigandBDBM17638
Substrate/Competitorn/a
Meas. Tech.ChEMBL_306012 (CHEMBL833528)
IC50 9.0±n/a nM
Citation Biava, MPorretta, GCCappelli, AVomero, SManetti, FBotta, MSautebin, LRossi, AMakovec, FAnzini, M 1,5-Diarylpyrrole-3-acetic acids and esters as novel classes of potent and highly selective cyclooxygenase-2 inhibitors. J Med Chem48:3428-32 (2005) 
 
Prostaglandin G/H synthase 2
Name:Prostaglandin G/H synthase 2
Type:Protein
Mol. Mass.:69020.39
Organism:Mus musculus (Mouse)
Description:Q05769
Residue:604
BDBM17638
NameBDBM17638
Synonyms:2-{1-[(4-chlorophenyl)carbonyl]-5-methoxy-2-methyl-1H-indol-3-yl}acetic acid Indocin US11478464, Compound Indomethacin US9271961, Indomethacin | indometacin
TypeSmall organic molecule
Emp. Form.C19H16ClNO4
Mol. Mass.357.788
SMILESCOc1ccc2n(C(=O)c3ccc(Cl)cc3)c(C)c(CC(O)=O)c2c1