Reaction Details
TargetPeroxisome proliferator-activated receptor gamma
LigandBDBM50166298
Substrate/Competitorn/a
Meas. Tech.ChEMBL_306696 (CHEMBL830853)
IC50 5±n/a nM
Citation Liu, KBlack, RMActon, JJMosley, RDebenham, SAbola, RYang, MTschirret-Guth, RColwell, LLiu, CWu, MWang, CFMacNaul, KLMcCann, MEMoller, DEBerger, JPMeinke, PTJones, ABWood, HB Selective PPARgamma modulators with improved pharmacological profiles. Bioorg Med Chem Lett15:2437-40 (2005) 
 
Peroxisome proliferator-activated receptor gamma
Name:Peroxisome proliferator-activated receptor gamma
Type:Nuclear Receptor
Mol. Mass.:57613.46
Organism:Homo sapiens (Human)
Description:P37231
Residue:505
BDBM50166298
NameBDBM50166298
Synonyms:(2S)-2-(4-chloro-3-(1-(6-chlorobenzo[d]isoxazol-3-yl)-2-methyl-5-(trifluoromethoxy)-1H-indol-3-yloxy)phenoxy)propanoic acid CHEMBL363805
TypeSmall organic molecule
Emp. Form.C26H17Cl2F3N2O6
Mol. Mass.581.324
SMILESC[C@H](Oc1ccc(Cl)c(Oc2c(C)n(-c3noc4cc(Cl)ccc34)c3ccc(OC(F)(F)F)cc23)c1)C(O)=O