Reaction Details
TargetDipeptidyl peptidase 4
LigandBDBM50166311
Substrate/Competitorn/a
Meas. Tech.ChEMBL_305151 (CHEMBL876981)
IC50 0.53±n/a nM
Citation Sakashita, HKitajima, HNakamura, MAkahoshi, FHayashi, Y 1-((S)-gamma-substituted prolyl)-(S)-2-cyanopyrrolidine as a novel series of highly potent DPP-IV inhibitors. Bioorg Med Chem Lett15:2441-5 (2005) 
 
Dipeptidyl peptidase 4
Name:Dipeptidyl peptidase 4
Type:Enzyme
Mol. Mass.:88271.01
Organism:Homo sapiens (Human)
Description:P27487
Residue:766
BDBM50166311
NameBDBM50166311
Synonyms:(S)-1-((2S,4S)-4-Phenylamino-pyrrolidine-2-carbonyl)-pyrrolidine-2-carbonitrile | CHEMBL195335
TypeSmall organic molecule
Emp. Form.C16H20N4O
Mol. Mass.284.3562
SMILESO=C([C@@H]1C[C@@H](CN1)Nc1ccccc1)N1CCC[C@H]1C#N