Reaction Details
TargetDipeptidyl peptidase 4
LigandBDBM50166316
Substrate/Competitorn/a
Meas. Tech.ChEMBL_305067 (CHEMBL832699)
IC50 9.1±n/a nM
Citation Sakashita, HKitajima, HNakamura, MAkahoshi, FHayashi, Y 1-((S)-gamma-substituted prolyl)-(S)-2-cyanopyrrolidine as a novel series of highly potent DPP-IV inhibitors. Bioorg Med Chem Lett15:2441-5 (2005) 
 
Dipeptidyl peptidase 4
Name:Dipeptidyl peptidase 4
Type:Enzyme
Mol. Mass.:88084.94
Organism:Rattus norvegicus (rat)
Description:n/a
Residue:767
BDBM50166316
NameBDBM50166316
Synonyms:(S)-1-((2S,4S)-4-Amino-pyrrolidine-2-carbonyl)-pyrrolidine-2-carbonitrile | CHEMBL191699
TypeSmall organic molecule
Emp. Form.C10H16N4O
Mol. Mass.208.2602
SMILESN[C@@H]1CN[C@@H](C1)C(=O)N1CCC[C@H]1C#N