Reaction Details
TargetDipeptidyl peptidase 4
LigandBDBM50166320
Substrate/Competitorn/a
Meas. Tech.ChEMBL_305067 (CHEMBL832699)
IC50 0.26±n/a nM
Citation Sakashita, HKitajima, HNakamura, MAkahoshi, FHayashi, Y 1-((S)-gamma-substituted prolyl)-(S)-2-cyanopyrrolidine as a novel series of highly potent DPP-IV inhibitors. Bioorg Med Chem Lett15:2441-5 (2005) 
 
Dipeptidyl peptidase 4
Name:Dipeptidyl peptidase 4
Type:Enzyme
Mol. Mass.:88084.94
Organism:Rattus norvegicus (rat)
Description:n/a
Residue:767
BDBM50166320
NameBDBM50166320
Synonyms:(S)-1-[(2S,4S)-4-(4-Cyano-phenylamino)-pyrrolidine-2-carbonyl]-pyrrolidine-2-carbonitrile | CHEMBL371143
TypeSmall organic molecule
Emp. Form.C17H19N5O
Mol. Mass.309.3657
SMILESO=C([C@@H]1C[C@@H](CN1)Nc1ccc(cc1)C#N)N1CCC[C@H]1C#N