Reaction Details
TargetDipeptidyl peptidase 4
LigandBDBM50166317
Substrate/Competitorn/a
Meas. Tech.ChEMBL_305067 (CHEMBL832699)
IC50 0.28±n/a nM
Citation Sakashita, HKitajima, HNakamura, MAkahoshi, FHayashi, Y 1-((S)-gamma-substituted prolyl)-(S)-2-cyanopyrrolidine as a novel series of highly potent DPP-IV inhibitors. Bioorg Med Chem Lett15:2441-5 (2005) 
 
Dipeptidyl peptidase 4
Name:Dipeptidyl peptidase 4
Type:Enzyme
Mol. Mass.:88084.94
Organism:Rattus norvegicus (rat)
Description:n/a
Residue:767
BDBM50166317
NameBDBM50166317
Synonyms:(S)-1-[(2S,4S)-4-(4-Methoxy-phenylamino)-pyrrolidine-2-carbonyl]-pyrrolidine-2-carbonitrile | CHEMBL195063
TypeSmall organic molecule
Emp. Form.C17H22N4O2
Mol. Mass.314.3822
SMILESCOc1ccc(N[C@@H]2CN[C@@H](C2)C(=O)N2CCC[C@H]2C#N)cc1