Reaction Details
TargetTyrosine-protein phosphatase non-receptor type 1
LigandBDBM50166435
Substrate/Competitorn/a
Meas. Tech.ChEMBL_304766 (CHEMBL829362)
IC50 2470±n/a nM
Citation Black, EBreed, JBreeze, ALEmbrey, KGarcia, RGero, TWGodfrey, LKenny, PWMorley, ADMinshull, CAPannifer, ADRead, JRees, ARussell, DJToader, DTucker, J Structure-based design of protein tyrosine phosphatase-1B inhibitors. Bioorg Med Chem Lett15:2503-7 (2005) 
 
Tyrosine-protein phosphatase non-receptor type 1
Name:Tyrosine-protein phosphatase non-receptor type 1
Type:Protein phosphatase
Mol. Mass.:49963.76
Organism:Homo sapiens (Human)
Description:Human recombinant GST-fusion PTP1B (1-435).
Residue:435
BDBM50166435
NameBDBM50166435
Synonyms:5-(4-METHOXYBIPHENYL-3-YL)-1,2,5-THIADIAZOLIDIN-3-ONE 1,1-DIOXIDE 5-(4-Methoxy[1,1'-biphenyl]-3-yl)-1,2,5-thiadiazolidin-3-one 1,1-Dioxide (2a) | CHEMBL193233
TypeSmall organic molecule
Emp. Form.C15H14N2O4S
Mol. Mass.318.348
SMILESCOc1ccc(cc1N1CC(=O)NS1(=O)=O)-c1ccccc1