Reaction Details
TargetGonadotropin-releasing hormone receptor
LigandBDBM50166437
Substrate/Competitorn/a
Meas. Tech.ChEMBL_303284 (CHEMBL828277)
Ki 1±n/a nM
Citation Guo, ZChen, YHuang, CQGross, TDPontillo, JRowbottom, MWSaunders, JStruthers, STucci, FCXie, QWade, WZhu, YFWu, DChen, C Uracils as potent antagonists of the human gonadotropin-releasing hormone receptor without atropisomers. Bioorg Med Chem Lett15:2519-22 (2005) 
 
Gonadotropin-releasing hormone receptor
Name:Gonadotropin-releasing hormone receptor
Type:Enzyme
Mol. Mass.:37749.45
Organism:Homo sapiens (Human)
Description:P30968
Residue:328
BDBM50166437
NameBDBM50166437
Synonyms:3-((R)-2-Amino-2-phenyl-ethyl)-5-(2-chloro-3-methoxy-phenyl)-1-(2,6-difluoro-benzyl)-1H-pyrimidine-2,4-dione | CHEMBL192912
TypeSmall organic molecule
Emp. Form.C26H22ClF2N3O3
Mol. Mass.497.921
SMILESCOc1cccc(c1Cl)-c1cn(Cc2c(F)cccc2F)c(=O)n(C[C@H](N)c2ccccc2)c1=O