Reaction Details
TargetGonadotropin-releasing hormone receptor
LigandBDBM50166441
Substrate/Competitorn/a
Meas. Tech.ChEMBL_303284 (CHEMBL828277)
Ki 0.45±n/a nM
Citation Guo, ZChen, YHuang, CQGross, TDPontillo, JRowbottom, MWSaunders, JStruthers, STucci, FCXie, QWade, WZhu, YFWu, DChen, C Uracils as potent antagonists of the human gonadotropin-releasing hormone receptor without atropisomers. Bioorg Med Chem Lett15:2519-22 (2005) 
 
Gonadotropin-releasing hormone receptor
Name:Gonadotropin-releasing hormone receptor
Type:Enzyme
Mol. Mass.:37749.45
Organism:Homo sapiens (Human)
Description:P30968
Residue:328
BDBM50166441
NameBDBM50166441
Synonyms:(R)-1-(2-fluoro-6-(trifluoromethyl)benzyl)-3-(2-amino-2-phenylethyl)-5-(2-chloro-3-methoxyphenyl)pyrimidine-2,4(1H,3H)-dione CHEMBL192955
TypeSmall organic molecule
Emp. Form.C27H22ClF4N3O3
Mol. Mass.547.928
SMILESCOc1cccc(c1Cl)-c1cn(Cc2c(F)cccc2C(F)(F)F)c(=O)n(C[C@H](N)c2ccccc2)c1=O