Reaction Details
TargetUDP-N-acetylenolpyruvoylglucosamine reductase
LigandBDBM50166479
Substrate/Competitorn/a
Meas. Tech.ChEMBL_304867 (CHEMBL829244)
IC50>50000±n/a nM
Citation Kutterer, KMDavis, JMSingh, GYang, YHu, WSeverin, ARasmussen, BAKrishnamurthy, GFailli, AKatz, AH 4-Alkyl and 4,4'-dialkyl 1,2-bis(4-chlorophenyl)pyrazolidine-3,5-dione derivatives as new inhibitors of bacterial cell wall biosynthesis. Bioorg Med Chem Lett15:2527-31 (2005) 
 
UDP-N-acetylenolpyruvoylglucosamine reductase
Name:UDP-N-acetylenolpyruvoylglucosamine reductase
Type:Protein
Mol. Mass.:33791.48
Organism:Staphylococcus aureus (Firmicutes)
Description:S. aureus MurB
Residue:307
BDBM50166479
NameBDBM50166479
Synonyms:4-[2-(Benzyl-ethyl-amino)-ethyl]-1,2-bis-(4-chloro-phenyl)-pyrazolidine-3,5-dione | CHEMBL365523
TypeSmall organic molecule
Emp. Form.C26H25Cl2N3O2
Mol. Mass.482.402
SMILESCCN(CCc1c(O)n(-c2ccc(Cl)cc2)n(-c2ccc(Cl)cc2)c1=O)Cc1ccccc1