Reaction Details
TargetUDP-N-acetylglucosamine 1-carboxyvinyltransferase
LigandBDBM50166487
Substrate/Competitorn/a
Meas. Tech.ChEMBL_304763 (CHEMBL829360)
IC50>50000±n/a nM
Citation Kutterer, KMDavis, JMSingh, GYang, YHu, WSeverin, ARasmussen, BAKrishnamurthy, GFailli, AKatz, AH 4-Alkyl and 4,4'-dialkyl 1,2-bis(4-chlorophenyl)pyrazolidine-3,5-dione derivatives as new inhibitors of bacterial cell wall biosynthesis. Bioorg Med Chem Lett15:2527-31 (2005) 
 
UDP-N-acetylglucosamine 1-carboxyvinyltransferase
Name:UDP-N-acetylglucosamine 1-carboxyvinyltransferase
Type:Protein
Mol. Mass.:44814.62
Organism:Escherichia coli K-12 (Enterobacteria)
Description:E. coli MurA
Residue:419
BDBM50166487
NameBDBM50166487
Synonyms:1,2-Bis-(4-chloro-phenyl)-4-(3-trifluoromethyl-benzyl)-pyrazolidine-3,5-dione | CHEMBL195808
TypeSmall organic molecule
Emp. Form.C23H15Cl2F3N2O2
Mol. Mass.479.279
SMILESOc1c(Cc2cccc(c2)C(F)(F)F)c(=O)n(-c2ccc(Cl)cc2)n1-c1ccc(Cl)cc1