Reaction Details
TargetUDP-N-acetylenolpyruvoylglucosamine reductase
LigandBDBM50166475
Substrate/Competitorn/a
Meas. Tech.ChEMBL_304867 (CHEMBL829244)
IC50 8200.0±n/a nM
Citation Kutterer, KMDavis, JMSingh, GYang, YHu, WSeverin, ARasmussen, BAKrishnamurthy, GFailli, AKatz, AH 4-Alkyl and 4,4'-dialkyl 1,2-bis(4-chlorophenyl)pyrazolidine-3,5-dione derivatives as new inhibitors of bacterial cell wall biosynthesis. Bioorg Med Chem Lett15:2527-31 (2005) 
 
UDP-N-acetylenolpyruvoylglucosamine reductase
Name:UDP-N-acetylenolpyruvoylglucosamine reductase
Type:Protein
Mol. Mass.:33791.48
Organism:Staphylococcus aureus (Firmicutes)
Description:S. aureus MurB
Residue:307
BDBM50166475
NameBDBM50166475
Synonyms:1,2-Bis-(4-chloro-phenyl)-4,4-bis-(6-phenyl-hexyl)-pyrazolidine-3,5-dione | CHEMBL189528
TypeSmall organic molecule
Emp. Form.C39H42Cl2N2O2
Mol. Mass.641.669
SMILESClc1ccc(cc1)N1N(C(=O)C(CCCCCCc2ccccc2)(CCCCCCc2ccccc2)C1=O)c1ccc(Cl)cc1