Reaction Details
TargetUDP-N-acetylenolpyruvoylglucosamine reductase
LigandBDBM50166494
Substrate/Competitorn/a
Meas. Tech.ChEMBL_304764 (CHEMBL829361)
IC50 13000±n/a nM
Citation Kutterer, KMDavis, JMSingh, GYang, YHu, WSeverin, ARasmussen, BAKrishnamurthy, GFailli, AKatz, AH 4-Alkyl and 4,4'-dialkyl 1,2-bis(4-chlorophenyl)pyrazolidine-3,5-dione derivatives as new inhibitors of bacterial cell wall biosynthesis. Bioorg Med Chem Lett15:2527-31 (2005) 
 
UDP-N-acetylenolpyruvoylglucosamine reductase
Name:UDP-N-acetylenolpyruvoylglucosamine reductase
Type:Protein
Mol. Mass.:37848.05
Organism:Escherichia coli K-12 (Enterobacteria)
Description:E. coli MurB
Residue:342
BDBM50166494
NameBDBM50166494
Synonyms:1,2-Bis-(4-chloro-phenyl)-4-[3-(4-fluoro-phenyl)-3-oxo-propyl]-pyrazolidine-3,5-dione | CHEMBL195098
TypeSmall organic molecule
Emp. Form.C24H17Cl2FN2O3
Mol. Mass.471.308
SMILESOc1c(CCC(=O)c2ccc(F)cc2)c(=O)n(-c2ccc(Cl)cc2)n1-c1ccc(Cl)cc1