Reaction Details
TargetUDP-N-acetylenolpyruvoylglucosamine reductase
LigandBDBM50166496
Substrate/Competitorn/a
Meas. Tech.ChEMBL_304764 (CHEMBL829361)
IC50 11000±n/a nM
Citation Kutterer, KMDavis, JMSingh, GYang, YHu, WSeverin, ARasmussen, BAKrishnamurthy, GFailli, AKatz, AH 4-Alkyl and 4,4'-dialkyl 1,2-bis(4-chlorophenyl)pyrazolidine-3,5-dione derivatives as new inhibitors of bacterial cell wall biosynthesis. Bioorg Med Chem Lett15:2527-31 (2005) 
 
UDP-N-acetylenolpyruvoylglucosamine reductase
Name:UDP-N-acetylenolpyruvoylglucosamine reductase
Type:Protein
Mol. Mass.:37848.05
Organism:Escherichia coli K-12 (Enterobacteria)
Description:E. coli MurB
Residue:342
BDBM50166496
NameBDBM50166496
Synonyms:1-{4-[1,2-Bis-(4-chloro-phenyl)-3,5-dioxo-pyrazolidin-4-ylmethyl]-phenyl}-cyclohexa-2,4-dienecarbonitrile | CHEMBL195201
TypeSmall organic molecule
Emp. Form.C29H21Cl2N3O2
Mol. Mass.514.402
SMILESOc1c(Cc2ccc(cc2)C2(CC=CC=C2)C#N)c(=O)n(-c2ccc(Cl)cc2)n1-c1ccc(Cl)cc1