Reaction Details
TargetUDP-N-acetylglucosamine 1-carboxyvinyltransferase
LigandBDBM50166499
Substrate/Competitorn/a
Meas. Tech.ChEMBL_304763 (CHEMBL829360)
IC50 20100±n/a nM
Citation Kutterer, KMDavis, JMSingh, GYang, YHu, WSeverin, ARasmussen, BAKrishnamurthy, GFailli, AKatz, AH 4-Alkyl and 4,4'-dialkyl 1,2-bis(4-chlorophenyl)pyrazolidine-3,5-dione derivatives as new inhibitors of bacterial cell wall biosynthesis. Bioorg Med Chem Lett15:2527-31 (2005) 
 
UDP-N-acetylglucosamine 1-carboxyvinyltransferase
Name:UDP-N-acetylglucosamine 1-carboxyvinyltransferase
Type:Protein
Mol. Mass.:44814.62
Organism:Escherichia coli K-12 (Enterobacteria)
Description:E. coli MurA
Residue:419
BDBM50166499
NameBDBM50166499
Synonyms:4,4-Bis-(2-benzyloxy-ethyl)-1,2-bis-(4-chloro-phenyl)-pyrazolidine-3,5-dione | CHEMBL370703
TypeSmall organic molecule
Emp. Form.C33H30Cl2N2O4
Mol. Mass.589.508
SMILESClc1ccc(cc1)N1N(C(=O)C(CCOCc2ccccc2)(CCOCc2ccccc2)C1=O)c1ccc(Cl)cc1