Reaction Details
TargetUDP-N-acetylenolpyruvoylglucosamine reductase
LigandBDBM50166485
Substrate/Competitorn/a
Meas. Tech.ChEMBL_304764 (CHEMBL829361)
IC50 5800±n/a nM
Citation Kutterer, KMDavis, JMSingh, GYang, YHu, WSeverin, ARasmussen, BAKrishnamurthy, GFailli, AKatz, AH 4-Alkyl and 4,4'-dialkyl 1,2-bis(4-chlorophenyl)pyrazolidine-3,5-dione derivatives as new inhibitors of bacterial cell wall biosynthesis. Bioorg Med Chem Lett15:2527-31 (2005) 
 
UDP-N-acetylenolpyruvoylglucosamine reductase
Name:UDP-N-acetylenolpyruvoylglucosamine reductase
Type:Protein
Mol. Mass.:37848.05
Organism:Escherichia coli K-12 (Enterobacteria)
Description:E. coli MurB
Residue:342
BDBM50166485
NameBDBM50166485
Synonyms:1,2-Bis-(4-chloro-phenyl)-4,4-bis-[2-(2,4-difluoro-phenyl)-2-oxo-ethyl]-pyrazolidine-3,5-dione MurB inhibitor (compound 17)
TypeSmall organic molecule
Emp. Form.C31H18Cl2F4N2O4
Mol. Mass.629.385
SMILESFc1ccc(C(=O)CC2(CC(=O)c3ccc(F)cc3F)C(=O)N(N(C2=O)c2ccc(Cl)cc2)c2ccc(Cl)cc2)c(F)c1