Reaction Details
TargetExtracellular calcium-sensing receptor
LigandBDBM50166510
Substrate/Competitorn/a
Meas. Tech.ChEMBL_306305 (CHEMBL828597)
IC50 100±n/a nM
Citation Shcherbakova, IHuang, GGeoffroy, OJNair, SKSwierczek, KBalandrin, MFFox, JHeaton, WLConklin, RL Design, new synthesis, and calcilytic activity of substituted 3H-pyrimidin-4-ones. Bioorg Med Chem Lett15:2537-40 (2005) 
 
Extracellular calcium-sensing receptor
Name:Extracellular calcium-sensing receptor
Type:Protein
Mol. Mass.:120663.13
Organism:Homo sapiens (Human)
Description:P41180
Residue:1078
BDBM50166510
NameBDBM50166510
Synonyms:5-Ethyl-2-(2-hydroxy-phenyl)-6-methyl-3-phenethyl-3H-pyrimidin-4-one | CHEMBL195859
TypeSmall organic molecule
Emp. Form.C21H22N2O2
Mol. Mass.334.4116
SMILESCCc1c(C)nc(-c2ccccc2O)n(CCc2ccccc2)c1=O