Reaction Details
TargetKappa-type opioid receptor
LigandBDBM50166631
Substrate/Competitorn/a
Meas. Tech.ChEMBL_302970 (CHEMBL827950)
Ki 1.9±n/a nM
Citation Le Bourdonnec, BAjello, CWSeida, PRSusnow, RGCassel, JABelanger, SStabley, GJDeHaven, RNDeHaven-Hudkins, DLDolle, RE Arylacetamide kappa opioid receptor agonists with reduced cytochrome P450 2D6 inhibitory activity. Bioorg Med Chem Lett15:2647-52 (2005) 
 
Kappa-type opioid receptor
Name:Kappa-type opioid receptor
Type:G Protein-Coupled Receptor (GPCR)
Mol. Mass.:42648.76
Organism:Homo sapiens (Human)
Description:P41145
Residue:380
BDBM50166631
NameBDBM50166631
Synonyms:2-(2-Methanesulfonyl-2,3-dihydro-1H-isoindol-5-yl)-N-methyl-N-((S)-1-phenyl-2-pyrrolidin-1-yl-ethyl)-acetamide | CHEMBL363718
TypeSmall organic molecule
Emp. Form.C24H31N3O3S
Mol. Mass.441.586
SMILESCN([C@H](CN1CCCC1)c1ccccc1)C(=O)Cc1ccc2CN(Cc2c1)S(C)(=O)=O