Reaction Details
TargetKappa-type opioid receptor
LigandBDBM50166618
Substrate/Competitorn/a
Meas. Tech.ChEMBL_304359 (CHEMBL839788)
EC50 5.7±n/a nM
Citation Le Bourdonnec, BAjello, CWSeida, PRSusnow, RGCassel, JABelanger, SStabley, GJDeHaven, RNDeHaven-Hudkins, DLDolle, RE Arylacetamide kappa opioid receptor agonists with reduced cytochrome P450 2D6 inhibitory activity. Bioorg Med Chem Lett15:2647-52 (2005) 
 
Kappa-type opioid receptor
Name:Kappa-type opioid receptor
Type:G Protein-Coupled Receptor (GPCR)
Mol. Mass.:42648.76
Organism:Homo sapiens (Human)
Description:P41145
Residue:380
BDBM50166618
NameBDBM50166618
Synonyms:CHEMBL192718 | N-[(S)-2-((S)-3-Hydroxy-pyrrolidin-1-yl)-1-phenyl-ethyl]-2-[4-(3-methanesulfonylamino-propyl)-phenyl]-N-methyl-acetamide
TypeSmall organic molecule
Emp. Form.C25H35N3O4S
Mol. Mass.473.628
SMILESCN([C@H](CN1CC[C@H](O)C1)c1ccccc1)C(=O)Cc1ccc(CCCNS(C)(=O)=O)cc1