Reaction Details
TargetDelta-type opioid receptor
LigandBDBM50166613
Substrate/Competitorn/a
Meas. Tech.ChEMBL_303005 (CHEMBL830244)
Ki 167±n/a nM
Citation Le Bourdonnec, BAjello, CWSeida, PRSusnow, RGCassel, JABelanger, SStabley, GJDeHaven, RNDeHaven-Hudkins, DLDolle, RE Arylacetamide kappa opioid receptor agonists with reduced cytochrome P450 2D6 inhibitory activity. Bioorg Med Chem Lett15:2647-52 (2005) 
 
Delta-type opioid receptor
Name:Delta-type opioid receptor
Type:G Protein-Coupled Receptor (GPCR)
Mol. Mass.:40382.98
Organism:Homo sapiens (Human)
Description:Competition binding assays were carried out using membrane preparations from transfected HN9.10 cells that constitutively expressed the delta opioid receptor.
Residue:372
BDBM50166613
NameBDBM50166613
Synonyms:2-{4-[(Butane-1-sulfonylamino)-methyl]-phenyl}-N-[(S)-2-((S)-3-hydroxy-pyrrolidin-1-yl)-1-phenyl-ethyl]-N-methyl-acetamide | CHEMBL362741
TypeSmall organic molecule
Emp. Form.C26H37N3O4S
Mol. Mass.487.655
SMILESCCCCS(=O)(=O)NCc1ccc(CC(=O)N(C)[C@H](CN2CC[C@H](O)C2)c2ccccc2)cc1