Reaction Details
TargetDelta-type opioid receptor
LigandBDBM50166619
Substrate/Competitorn/a
Meas. Tech.ChEMBL_303005 (CHEMBL830244)
Ki 167±n/a nM
Citation Le Bourdonnec, BAjello, CWSeida, PRSusnow, RGCassel, JABelanger, SStabley, GJDeHaven, RNDeHaven-Hudkins, DLDolle, RE Arylacetamide kappa opioid receptor agonists with reduced cytochrome P450 2D6 inhibitory activity. Bioorg Med Chem Lett15:2647-52 (2005) 
 
Delta-type opioid receptor
Name:Delta-type opioid receptor
Type:G Protein-Coupled Receptor (GPCR)
Mol. Mass.:40382.98
Organism:Homo sapiens (Human)
Description:Competition binding assays were carried out using membrane preparations from transfected HN9.10 cells that constitutively expressed the delta opioid receptor.
Residue:372
BDBM50166619
NameBDBM50166619
Synonyms:CHEMBL425897 | N-[(S)-2-((S)-3-Hydroxy-pyrrolidin-1-yl)-1-phenyl-ethyl]-2-[4-(methanesulfonylamino-methyl)-phenyl]-N-methyl-acetamide
TypeSmall organic molecule
Emp. Form.C23H31N3O4S
Mol. Mass.445.575
SMILESCN([C@H](CN1CC[C@H](O)C1)c1ccccc1)C(=O)Cc1ccc(CNS(C)(=O)=O)cc1