Reaction Details
TargetCytochrome P450 2D6
LigandBDBM50039966
Substrate/Competitorn/a
Meas. Tech.ChEMBL_306014 (CHEMBL874551)
IC50 46±n/a nM
Citation Le Bourdonnec, BAjello, CWSeida, PRSusnow, RGCassel, JABelanger, SStabley, GJDeHaven, RNDeHaven-Hudkins, DLDolle, RE Arylacetamide kappa opioid receptor agonists with reduced cytochrome P450 2D6 inhibitory activity. Bioorg Med Chem Lett15:2647-52 (2005) 
 
Cytochrome P450 2D6
Name:Cytochrome P450 2D6
Type:Protein
Mol. Mass.:55774.82
Organism:Homo sapiens (Human)
Description:P10635
Residue:497
BDBM50039966
NameBDBM50039966
Synonyms:1-[(S)-2-(Methyl-phenylacetyl-amino)-2-phenyl-ethyl]-pyrrolidinium N-Methyl-2-phenyl-N-((S)-1-phenyl-2-pyrrolidin-1-yl-ethyl)-acetamide
TypeSmall organic molecule
Emp. Form.C21H26N2O
Mol. Mass.322.4439
SMILESCN([C@H](CN1CCCC1)c1ccccc1)C(=O)Cc1ccccc1