Reaction Details
TargetKappa-type opioid receptor
LigandBDBM50007344
Substrate/Competitorn/a
Meas. Tech.ChEMBL_302970 (CHEMBL827950)
EC50 0.300000±n/a nM
Citation Le Bourdonnec, BAjello, CWSeida, PRSusnow, RGCassel, JABelanger, SStabley, GJDeHaven, RNDeHaven-Hudkins, DLDolle, RE Arylacetamide kappa opioid receptor agonists with reduced cytochrome P450 2D6 inhibitory activity. Bioorg Med Chem Lett15:2647-52 (2005) 
 
Kappa-type opioid receptor
Name:Kappa-type opioid receptor
Type:G Protein-Coupled Receptor (GPCR)
Mol. Mass.:42648.76
Organism:Homo sapiens (Human)
Description:P41145
Residue:380
BDBM50007344
NameBDBM50007344
Synonyms:(S)-2-(3,4-Dichloro-phenyl)-N-methyl-N-(1-phenyl-2-pyrrolidin-1-yl-ethyl)-acetamide(ICI 199441) 2-(3,4-Dichloro-phenyl)-N-methyl-N-((S)-1-phenyl-2-pyrrolidin-1-yl-ethyl)-acetamide CHEMBL38576 | ICI-199441
TypeSmall organic molecule
Emp. Form.C21H24Cl2N2O
Mol. Mass.391.334
SMILESCN([C@H](CN1CCCC1)c1ccccc1)C(=O)Cc1ccc(Cl)c(Cl)c1