Reaction Details
TargetCytochrome P450 2D6
LigandBDBM50166632
Substrate/Competitorn/a
Meas. Tech.ChEMBL_306014 (CHEMBL874551)
IC50 1220±n/a nM
Citation Le Bourdonnec, BAjello, CWSeida, PRSusnow, RGCassel, JABelanger, SStabley, GJDeHaven, RNDeHaven-Hudkins, DLDolle, RE Arylacetamide kappa opioid receptor agonists with reduced cytochrome P450 2D6 inhibitory activity. Bioorg Med Chem Lett15:2647-52 (2005) 
 
Cytochrome P450 2D6
Name:Cytochrome P450 2D6
Type:Protein
Mol. Mass.:55774.82
Organism:Homo sapiens (Human)
Description:P10635
Residue:497
BDBM50166632
NameBDBM50166632
Synonyms:CHEMBL192520 | N-Methyl-2-{4-[(3-methyl-ureido)-methyl]-phenyl}-N-((S)-1-phenyl-2-pyrrolidin-1-yl-ethyl)-acetamide
TypeSmall organic molecule
Emp. Form.C24H32N4O2
Mol. Mass.408.5365
SMILESCNC(=O)NCc1ccc(CC(=O)N(C)[C@H](CN2CCCC2)c2ccccc2)cc1