Reaction Details
TargetCytochrome P450 2D6
LigandBDBM50166617
Substrate/Competitorn/a
Meas. Tech.ChEMBL_306014 (CHEMBL874551)
IC50 5792±n/a nM
Citation Le Bourdonnec, BAjello, CWSeida, PRSusnow, RGCassel, JABelanger, SStabley, GJDeHaven, RNDeHaven-Hudkins, DLDolle, RE Arylacetamide kappa opioid receptor agonists with reduced cytochrome P450 2D6 inhibitory activity. Bioorg Med Chem Lett15:2647-52 (2005) 
 
Cytochrome P450 2D6
Name:Cytochrome P450 2D6
Type:Protein
Mol. Mass.:55774.82
Organism:Homo sapiens (Human)
Description:P10635
Residue:497
BDBM50166617
NameBDBM50166617
Synonyms:2-{4-[(4-Fluoro-benzenesulfonylamino)-methyl]-phenyl}-N-[(S)-2-((S)-3-hydroxy-pyrrolidin-1-yl)-1-phenyl-ethyl]-N-methyl-acetamide | CHEMBL190353
TypeSmall organic molecule
Emp. Form.C28H32FN3O4S
Mol. Mass.525.635
SMILESCN([C@H](CN1CC[C@H](O)C1)c1ccccc1)C(=O)Cc1ccc(CNS(=O)(=O)c2ccc(F)cc2)cc1