Reaction Details
TargetEstrogen receptor beta
LigandBDBM50166755
Substrate/Competitorn/a
Meas. Tech.ChEMBL_304718 (CHEMBL827158)
IC50 1.3±n/a nM
Citation McDevitt, REMalamas, MSManas, ESUnwalla, RJXu, ZBMiller, CPHarris, HA Estrogen receptor ligands: design and synthesis of new 2-arylindene-1-ones. Bioorg Med Chem Lett15:3137-42 (2005) 
 
Estrogen receptor beta
Name:Estrogen receptor beta
Type:Protein
Mol. Mass.:59238.43
Organism:Homo sapiens (Human)
Description:Q92731
Residue:530
BDBM50166755
NameBDBM50166755
Synonyms:5-Hydroxy-2-(4-hydroxy-phenyl)-3-methylsulfanyl-inden-1-one | CHEMBL192765
TypeSmall organic molecule
Emp. Form.C16H12O3S
Mol. Mass.284.33
SMILESCSC1=C(C(=O)c2ccc(O)cc12)c1ccc(O)cc1