Reaction Details
TargetEstrogen receptor
LigandBDBM50166760
Substrate/Competitorn/a
Meas. Tech.ChEMBL_304737 (CHEMBL829337)
IC50 2±n/a nM
Citation McDevitt, REMalamas, MSManas, ESUnwalla, RJXu, ZBMiller, CPHarris, HA Estrogen receptor ligands: design and synthesis of new 2-arylindene-1-ones. Bioorg Med Chem Lett15:3137-42 (2005) 
 
Estrogen receptor
Name:Estrogen receptor
Type:Protein
Mol. Mass.:66230.44
Organism:Homo sapiens (Human)
Description:P03372
Residue:595
BDBM50166760
NameBDBM50166760
Synonyms:4,6-Dihydroxy-2-(4-hydroxy-phenyl)-3-methylsulfanyl-inden-1-one | CHEMBL190038
TypeSmall organic molecule
Emp. Form.C16H12O4S
Mol. Mass.300.329
SMILESCSC1=C(C(=O)c2cc(O)cc(O)c12)c1ccc(O)cc1