Reaction Details
TargetSodium channel protein type 9 subunit alpha
LigandBDBM50166790
Substrate/Competitorn/a
Meas. Tech.ChEMBL_302188 (CHEMBL829428)
Ki 140±n/a nM
Citation Liang, JBrochu, RMCohen, CJDick, IEFelix, JPFisher, MHGarcia, MLKaczorowski, GJLyons, KAMeinke, PTPriest, BTSchmalhofer, WASmith, MMTarpley, JWWilliams, BSMartin, WJParsons, WH Discovery of potent and use-dependent sodium channel blockers for treatment of chronic pain. Bioorg Med Chem Lett15:2943-7 (2005) 
 
Sodium channel protein type 9 subunit alpha
Name:Sodium channel protein type 9 subunit alpha
Type:Protein
Mol. Mass.:226375.97
Organism:Homo sapiens (Human)
Description:Q15858
Residue:1988
BDBM50166790
NameBDBM50166790
Synonyms:CHEMBL364912 | {2-[2-(4-Chloro-phenyl)-thiazol-4-ylmethoxy]-3-methoxy-phenyl}-pyrrolidin-1-yl-methanone
TypeSmall organic molecule
Emp. Form.C22H21ClN2O3S
Mol. Mass.428.932
SMILESCOc1cccc(C(=O)N2CCCC2)c1OCc1csc(n1)-c1ccc(Cl)cc1