Reaction Details
TargetPotassium voltage-gated channel subfamily H member 2
LigandBDBM50166785
Substrate/Competitorn/a
Meas. Tech.ChEMBL_306311 (CHEMBL827704)
IC50 30±n/a nM
Citation Liang, JBrochu, RMCohen, CJDick, IEFelix, JPFisher, MHGarcia, MLKaczorowski, GJLyons, KAMeinke, PTPriest, BTSchmalhofer, WASmith, MMTarpley, JWWilliams, BSMartin, WJParsons, WH Discovery of potent and use-dependent sodium channel blockers for treatment of chronic pain. Bioorg Med Chem Lett15:2943-7 (2005) 
 
Potassium voltage-gated channel subfamily H member 2
Name:Potassium voltage-gated channel subfamily H member 2
Type:Multi-pass membrane protein
Mol. Mass.:126672.65
Organism:Homo sapiens (Human)
Description:Q12809
Residue:1159
BDBM50166785
NameBDBM50166785
Synonyms:1-{2-[2-(4-Chloro-phenyl)-thiazol-4-ylmethoxy]-benzyl}-azocane | CHEMBL195180
TypeSmall organic molecule
Emp. Form.C24H27ClN2OS
Mol. Mass.427.002
SMILESClc1ccc(cc1)-c1nc(COc2ccccc2CN2CCCCCCC2)cs1