Reaction Details
TargetPro-cathepsin H
LigandBDBM50167290
Substrate/Competitorn/a
Meas. Tech.ChEMBL_303001 (CHEMBL830240)
Ki 0.460000±n/a nM
Citation Barrett, DGDeaton, DNHassell, AMMcFadyen, RBMiller, ABMiller, LRPayne, JAShewchuk, LMWillard, DHWright, LL Acyclic cyanamide-based inhibitors of cathepsin K. Bioorg Med Chem Lett15:3039-43 (2005) 
 
Pro-cathepsin H
Name:Pro-cathepsin H
Type:PROTEIN
Mol. Mass.:37402.31
Organism:Homo sapiens (Human)
Description:ChEMBL_1459870
Residue:335
BDBM50167290
NameBDBM50167290
Synonyms:(1S)-2-cyclohexyl-1-methylethyl 2-cyano-2-isopropylhydrazinecarboxylate | CHEMBL371420
TypeSmall organic molecule
Emp. Form.C14H25N3O2
Mol. Mass.267.3672
SMILESC[C@@H](CC1CCCCC1)OC(=O)NN(C#N)C(C)C