Reaction Details
TargetPro-cathepsin H
LigandBDBM50167289
Substrate/Competitorn/a
Meas. Tech.ChEMBL_302985 (CHEMBL876371)
Ki 1.4±n/a nM
Citation Barrett, DGDeaton, DNHassell, AMMcFadyen, RBMiller, ABMiller, LRPayne, JAShewchuk, LMWillard, DHWright, LL Acyclic cyanamide-based inhibitors of cathepsin K. Bioorg Med Chem Lett15:3039-43 (2005) 
 
Pro-cathepsin H
Name:Pro-cathepsin H
Type:PROTEIN
Mol. Mass.:37402.31
Organism:Homo sapiens (Human)
Description:ChEMBL_1459870
Residue:335
BDBM50167289
NameBDBM50167289
Synonyms:(1S)-2-cyclohexyl-1-methylethyl 2-cyano-2-methylhydrazinecarboxylate | CHEMBL190121
TypeSmall organic molecule
Emp. Form.C12H21N3O2
Mol. Mass.239.314
SMILESC[C@@H](CC1CCCCC1)OC(=O)NN(C)C#N