Reaction Details
TargetCathepsin K
LigandBDBM50167300
Substrate/Competitorn/a
Meas. Tech.ChEMBL_303352 (CHEMBL839667)
Ki>13000±n/a nM
Citation Barrett, DGDeaton, DNHassell, AMMcFadyen, RBMiller, ABMiller, LRPayne, JAShewchuk, LMWillard, DHWright, LL Acyclic cyanamide-based inhibitors of cathepsin K. Bioorg Med Chem Lett15:3039-43 (2005) 
 
Cathepsin K
Name:Cathepsin K
Type:Enzyme
Mol. Mass.:36975.68
Organism:Homo sapiens (Human)
Description:P43235
Residue:329
BDBM50167300
NameBDBM50167300
Synonyms:((R)-Cyano-methyl-methyl)-carbamic acid (S)-2-cyclohexyl-1-methyl-ethyl ester | CHEMBL189891
TypeSmall organic molecule
Emp. Form.C13H22N2O2
Mol. Mass.238.326
SMILESC[C@@H](CC1CCCCC1)OC(=O)N[C@H](C)C#N