Reaction Details
TargetProcathepsin L
LigandBDBM50167288
Substrate/Competitorn/a
Meas. Tech.ChEMBL_302893 (CHEMBL830209)
Ki 0.036000±n/a nM
Citation Barrett, DGDeaton, DNHassell, AMMcFadyen, RBMiller, ABMiller, LRPayne, JAShewchuk, LMWillard, DHWright, LL Acyclic cyanamide-based inhibitors of cathepsin K. Bioorg Med Chem Lett15:3039-43 (2005) 
 
Procathepsin L
Name:Procathepsin L
Type:Enzyme
Mol. Mass.:37557.19
Organism:Homo sapiens (Human)
Description:Purchased from Calbiochem (San Diego, CA).
Residue:333
BDBM50167288
NameBDBM50167288
Synonyms:(1S)-1-benzylpropyl 2-cyano-2-methylhydrazinecarboxylate | CHEMBL191558
TypeSmall organic molecule
Emp. Form.C13H17N3O2
Mol. Mass.247.293
SMILESCC[C@@H](Cc1ccccc1)OC(=O)NN(C)C#N