Reaction Details
TargetReplicase polyprotein 1a
LigandBDBM50167314
Substrate/Competitorn/a
Meas. Tech.ChEMBL_305843 (CHEMBL829584)
IC50 7200±n/a nM
Citation Chen, LRWang, YCLin, YWChou, SYChen, SFLiu, LTWu, YTKuo, CJChen, TSJuang, SH Synthesis and evaluation of isatin derivatives as effective SARS coronavirus 3CL protease inhibitors. Bioorg Med Chem Lett15:3058-62 (2005) 
 
Replicase polyprotein 1a
Name:Replicase polyprotein 1a
Type:Enzyme
Mol. Mass.:486353.36
Organism:Human SARS coronavirus (SARS-CoV)
Description:P0C6U8
Residue:4382
BDBM50167314
NameBDBM50167314
Synonyms:1-(3,5-Dimethyl-isoxazol-4-ylmethyl)-2,3-dioxo-2,3-dihydro-1H-indole-5-carbonitrile acs.jmedchem.1c00409_ST.460
TypeSmall organic molecule
Emp. Form.C15H11N3O3
Mol. Mass.281.2661
SMILESCc1noc(C)c1CN1C(=O)C(=O)c2cc(ccc12)C#N