Reaction Details
TargetReplicase polyprotein 1a
LigandBDBM50167317
Substrate/Competitorn/a
Meas. Tech.ChEMBL_305843 (CHEMBL829584)
IC50 9400±n/a nM
Citation Chen, LRWang, YCLin, YWChou, SYChen, SFLiu, LTWu, YTKuo, CJChen, TSJuang, SH Synthesis and evaluation of isatin derivatives as effective SARS coronavirus 3CL protease inhibitors. Bioorg Med Chem Lett15:3058-62 (2005) 
 
Replicase polyprotein 1a
Name:Replicase polyprotein 1a
Type:Enzyme
Mol. Mass.:486353.36
Organism:Human SARS coronavirus (SARS-CoV)
Description:P0C6U8
Residue:4382
BDBM50167317
NameBDBM50167317
Synonyms:1-(2-Chloro-4-fluoro-benzyl)-5-iodo-1H-indole-2,3-dione acs.jmedchem.1c00409_ST.498
TypeSmall organic molecule
Emp. Form.C15H8ClFINO2
Mol. Mass.415.585
SMILESFc1ccc(CN2C(=O)C(=O)c3cc(I)ccc23)c(Cl)c1