Reaction Details
TargetCarbonic anhydrase 1
LigandBDBM50167367
Substrate/Competitorn/a
Meas. Tech.ChEMBL_308633 (CHEMBL834886)
Ki 92±n/a nM
Citation Winum, JYCecchi, AMontero, JLInnocenti, AScozzafava, ASupuran, CT Carbonic anhydrase inhibitors. Synthesis and inhibition of cytosolic/tumor-associated carbonic anhydrase isozymes I, II, and IX with boron-containing sulfonamides, sulfamides, and sulfamates: toward agents for boron neutron capture therapy of hypoxic tumors. Bioorg Med Chem Lett15:3302-6 (2005) 
 
Carbonic anhydrase 1
Name:Carbonic anhydrase 1
Type:Enzyme
Mol. Mass.:28873.37
Organism:Homo sapiens (Human)
Description:P00915
Residue:261
BDBM50167367
NameBDBM50167367
Synonyms:(4,4,5,5-tetramethyl-1,3,2-dioxaborolan-2-yl)phenylsulfamide N-[4-(4,4,5,5-tetramethyl-1,3,2-dioxaborolan-2-yl)phenyl]aminosulfonamide | N-[4-(4,4,5,5-tetramethyl-1,3,2-dioxaborolan-2-yl)phenyl]sulfamide
TypeSmall organic molecule
Emp. Form.C12H19BN2O4S
Mol. Mass.298.166
SMILESCC1(C)OB(OC1(C)C)c1ccc(NS(N)(=O)=O)cc1