Reaction Details
TargetCarbonic anhydrase 2
LigandBDBM50167400
Substrate/Competitorn/a
Meas. Tech.ChEMBL_302531 (CHEMBL827383)
Ki 5.5±n/a nM
Citation Puccetti, LFasolis, GVullo, DChohan, ZHScozzafava, ASupuran, CT Carbonic anhydrase inhibitors. Inhibition of cytosolic/tumor-associated carbonic anhydrase isozymes I, II, IX, and XII with Schiff's bases incorporating chromone and aromatic sulfonamide moieties, and their zinc complexes. Bioorg Med Chem Lett15:3096-101 (2005) 
 
Carbonic anhydrase 2
Name:Carbonic anhydrase 2
Type:Enzyme
Mol. Mass.:29250.71
Organism:Homo sapiens (Human)
Description:P00918
Residue:260
BDBM50167400
NameBDBM50167400
Synonyms:CHEMBL193958 | sulfanilamide derivative
TypeSmall organic molecule
Emp. Form.C34H30Cl2N4O8S2Zn
Mol. Mass.823.068
SMILESCc1ccc2OC=C3C=[N+](c4ccc(cc4)S(N)(=O)=O)[Zn]4(Cl)(Cl)(OC3c2c1)OC1C(=COc2ccc(C)cc12)C=[N+]4c1ccc(cc1)S(N)(=O)=O